BDBM50289659 CHEMBL49336::[(S)-1-(4-Oxo-4H-thieno[3,2-d][1,3]oxazin-2-yl)-ethyl]-carbamic acid benzyl ester
SMILES C[C@H](NC(=O)OCc1ccccc1)c1nc2ccsc2c(=O)o1
InChI Key InChIKey=RITZIOXCWRPEIQ-JTQLQIEISA-N
Data  1 IC50
  Tab Delimited (TSV)   2D SDfile   Computed 3D by Vconf -m prep SDfile
Find this compound or compounds like it in BindingDB:
Activity Spreadsheet -- Enzyme Inhibition Constant Data from BindingDB
Found 1 hit for monomerid = 50289659
TargetCapsid scaffolding protein(Human herpesvirus 1 (strain 17) (HHV-1) (Human her...)
TBA
Curated by ChEMBL
LigandPNGBDBM50289659(CHEMBL49336 | [(S)-1-(4-Oxo-4H-thieno[3,2-d][1,3]o...)
Affinity DataIC50:  480nM. Assay description: Inhibitory concentration for peptidolytic activity against herpes simplex type-1 (HSV-1) protease at 10 uM.
In DepthDetails Article